Reaction Details
TargetThymidylate synthase
LigandBDBM36712
Substrate/Competitorn/a
Meas. Tech.Enzyme Assay
pH7.4±0
Temperature293.15±0 K
IC50 5.3e+4±n/a nM
Citation Tondi, DSlomczynska, UCosti, MPWatterson, DMGhelli, SShoichet, BK Structure-based discovery and in-parallel optimization of novel competitive inhibitors of thymidylate synthase. Chem Biol6:319-31 (1999) 
 
Thymidylate synthase
Name:Thymidylate synthase
Type:Enzyme
Mol. Mass.:36576.54
Organism:Lactobacillus casei
Description:n/a
Residue:316
BDBM36712
NameBDBM36712
Synonyms:Dansyltyrosine deriviative 31B
TypeSmall organic molecule
Emp. Form.C39H45N3O7S2
Mol. Mass.731.921
SMILESCCCCN(CCCC)c1cccc2c(cccc12)S(=O)(=O)N[C@@H](Cc1ccc(OS(=O)(=O)c2cccc3c(cccc23)N(C)C)cc1)C(O)=O