Reaction Details
TargetRetinoic acid receptor alpha [200-419]/gamma [183-417]
LigandBDBM36810
Substrate/Competitorn/a
Meas. Tech.Competitive Assay
pH8±0
Temperature277.15±0 K
Ki 1.0±0.0 nM
Citation Géhin, MVivat, VWurtz, JMLosson, RChambon, PMoras, DGronemeyer, H Structural basis for engineering of retinoic acid receptor isotype-selective agonists and antagonists. Chem Biol6:519-29 (1999) 
 
Retinoic acid receptor alpha [200-419]/gamma [183-417]
Name:Retinoic acid receptor alpha [200-419]/gamma [183-417]
Synonyms:Retinoic Acid Receptors Gamma / Alpha
Type:Protein
Mol. Mass.:n/a
Description:n/a
Components:This complex has 2 components.
Component 1
Name:Retinoic acid receptor gamma [183-417]
Type:Ligand-binding domain
Mol. Mass.:26502.27
Organism:Homo sapiens (Human)
Description:P13631[183-417]
Residue:235
Component 2
Name:Retinoic acid receptor alpha [200-419]
Synonyms:NR1B1 RAR-alpha RARA_HUMAN | Retinoic Acid Receptor, alpha
Type:Ligand-binding domain
Mol. Mass.:24746.59
Organism:Homo sapiens (Human)
Description:P10276[200-419]
Residue:220
BDBM36810
NameBDBM36810
Synonyms:BMS753 | US9963439, BMS753
TypeSmall organic molecule
Emp. Form.C21H21NO4
Mol. Mass.351.3957
SMILESCC1(C)C(=O)C(C)(C)c2cc(ccc12)C(=O)Nc1ccc(cc1)C(O)=O