Reaction Details
TargetEpidermal growth factor receptor [1-999,L858R]
LigandBDBM13216
Substrate/Competitorn/a
Meas. Tech.Kinase Inhibitor Selectivity Profiling Assay
Kd 120000±n/a nM
Citation PubChem, PC Kinase Inhibitor Selectivity Profiling Assay PubChem Bioassay(2008)[AID]
 
Epidermal growth factor receptor [1-999,L858R]
Name:Epidermal growth factor receptor [1-999,L858R]
Type:Enzyme Catalytic Domain
Mol. Mass.:111216.35
Organism:Homo sapiens (Human)
Description:P00533[1-999,L858R]
Residue:999
BDBM13216
NameBDBM13216
Synonyms:BMS-354825 DASATINIB N-(2-chloro-6-methylphenyl)-2-({6-[4-(2-hydroxyethyl)piperazin-1-yl]-2-methylpyrimidin-4-yl}amino)-1,3-thiazole-5-carboxamide US20230348453, Compound A8 med.21724, Compound Dasatinib
TypeSmall organic molecule
Emp. Form.C22H26ClN7O2S
Mol. Mass.488.006
SMILESCc1nc(Nc2ncc(s2)C(=O)Nc2c(C)cccc2Cl)cc(n1)N1CCN(CCO)CC1