Reaction Details
TargetEpidermal growth factor receptor [1-999,L858R]
LigandBDBM21
Substrate/Competitorn/a
Meas. Tech.Kinase Inhibitor Selectivity Profiling Assay
Kd 8700±n/a nM
Citation PubChem, PC Kinase Inhibitor Selectivity Profiling Assay PubChem Bioassay(2008)[AID]
 
Epidermal growth factor receptor [1-999,L858R]
Name:Epidermal growth factor receptor [1-999,L858R]
Type:Enzyme Catalytic Domain
Mol. Mass.:111216.35
Organism:Homo sapiens (Human)
Description:P00533[1-999,L858R]
Residue:999
BDBM21
NameBDBM21
Synonyms:CHEMBL24828 VANDETANIB ZD6474 | cid_3081361
Typen/a
Emp. Form.C22H24BrFN4O2
Mol. Mass.475.354
SMILESCOc1cc2c(Nc3ccc(Br)cc3F)ncnc2cc1OCC1CCN(C)CC1