Reaction Details
TargetEphrin type-A receptor 2
LigandBDBM31088
Substrate/Competitorn/a
Meas. Tech.Kinase Inhibitor Selectivity Profiling Assay
Kd 2900±n/a nM
Citation PubChem, PC Kinase Inhibitor Selectivity Profiling Assay PubChem Bioassay(2008)[AID]
 
Ephrin type-A receptor 2
Name:Ephrin type-A receptor 2
Type:PROTEIN
Mol. Mass.:108260.70
Organism:Homo sapiens (Human)
Description:ChEMBL_1505248
Residue:976
BDBM31088
NameBDBM31088
Synonyms:1-methyl-5-[2-[5-(trifluoromethyl)-1H-imidazol-2-yl]pyridin-4-yl]oxy-N-[4-(trifluoromethyl)phenyl]benzimidazol-2-amine CHIR-265 cid_11656518
TypeSmall organic molecule
Emp. Form.C24H16F6N6O
Mol. Mass.518.4139
SMILESCn1c(Nc2ccc(cc2)C(F)(F)F)nc2cc(Oc3ccnc(c3)-c3ncc([nH]3)C(F)(F)F)ccc12