Reaction Details
TargetEphrin type-A receptor 5
LigandBDBM31085
Substrate/Competitorn/a
Meas. Tech.Kinase Inhibitor Selectivity Profiling Assay
Kd 140±n/a nM
Citation PubChem, PC Kinase Inhibitor Selectivity Profiling Assay PubChem Bioassay(2008)[AID]
 
Ephrin type-A receptor 5
Name:Ephrin type-A receptor 5
Type:PROTEIN
Mol. Mass.:114807.59
Organism:Homo sapiens (Human)
Description:ChEMBL_774217
Residue:1037
BDBM31085
NameBDBM31085
Synonyms:1-[4-[(4-ethyl-1-piperazinyl)methyl]-3-(trifluoromethyl)phenyl]-3-[4-[[6-(methylamino)-4-pyrimidinyl]oxy]phenyl]urea 1-[4-[(4-ethylpiperazino)methyl]-3-(trifluoromethyl)phenyl]-3-[4-[6-(methylamino)pyrimidin-4-yl]oxyphenyl]urea cid_11409972
TypeSmall organic molecule
Emp. Form.C26H30F3N7O2
Mol. Mass.529.5573
SMILESCCN1CCN(Cc2ccc(NC(=O)Nc3ccc(Oc4cc(NC)ncn4)cc3)cc2C(F)(F)F)CC1