Reaction Details
Target5-hydroxytryptamine receptor 1A
LigandBDBM263988
Substrate/Competitorn/a
Meas. Tech.Human 5-HT1A Receptor Binding Assay
pH7.4±n/a
Ki 2.50±n/a nM
Commentsextracted
Citation Zhang, YJin, CZhou, R Substituted piperazine compounds and methods of use thereof US Patent US9714232 Publication Date 7/25/2017
 
5-hydroxytryptamine receptor 1A
Name:5-hydroxytryptamine receptor 1A
Type:n/a
Mol. Mass.:46122.49
Organism:Homo sapiens (Human)
Description:n/a
Residue:422
BDBM263988
NameBDBM263988
Synonyms:1-(4-(4-(4-(5-fluoro-1H-indol-3-yl)butyl)piperazin-1-yl)phenyl)piperidin-2-one | US9714232, 1
TypeSmall organic molecule
Emp. Form.C27H33FN4O
Mol. Mass.448.5755
SMILESFc1ccc2[nH]cc(CCCCN3CCN(CC3)c3ccc(cc3)N3CCCCC3=O)c2c1