Reaction Details
Target5-hydroxytryptamine receptor 1A
LigandBDBM264091
Substrate/Competitorn/a
Meas. Tech.Human 5-HT1A Receptor Binding Assay
pH7.4±n/a
Ki 1.20±n/a nM
Commentsextracted
Citation Zhang, YJin, CZhou, R Substituted piperazine compounds and methods of use thereof US Patent US9714232 Publication Date 7/25/2017
 
5-hydroxytryptamine receptor 1A
Name:5-hydroxytryptamine receptor 1A
Type:n/a
Mol. Mass.:46122.49
Organism:Homo sapiens (Human)
Description:n/a
Residue:422
BDBM264091
NameBDBM264091
Synonyms:3-(3-(4-(4-(2-oxopiperidin-1-yl)phenyl)piperazin-1-yl)propyl)-1H-indole-5-carbonitrile | US9714232, 4
TypeSmall organic molecule
Emp. Form.C27H31N5O
Mol. Mass.441.5679
SMILESO=C1CCCCN1c1ccc(cc1)N1CCN(CCCc2c[nH]c3ccc(cc23)C#N)CC1