Reaction Details
Target5-hydroxytryptamine receptor 1A
LigandBDBM264093
Substrate/Competitorn/a
Meas. Tech.Human 5-HT1A Receptor Binding Assay
pH7.4±n/a
Ki 2.10±n/a nM
Commentsextracted
Citation Zhang, YJin, CZhou, R Substituted piperazine compounds and methods of use thereof US Patent US9714232 Publication Date 7/25/2017
 
5-hydroxytryptamine receptor 1A
Name:5-hydroxytryptamine receptor 1A
Type:n/a
Mol. Mass.:46122.49
Organism:Homo sapiens (Human)
Description:n/a
Residue:422
BDBM264093
NameBDBM264093
Synonyms:3-(4-(4-(4-(3-oxomorpholino)phenyl)piperazin-1-yl)butyl)-1H-indole-5-carbonitrile | US9714232, 6
TypeSmall organic molecule
Emp. Form.C27H31N5O2
Mol. Mass.457.5673
SMILESO=C1COCCN1c1ccc(cc1)N1CCN(CCCCc2c[nH]c3ccc(cc23)C#N)CC1