Reaction Details
Target5-hydroxytryptamine receptor 1A
LigandBDBM264104
Substrate/Competitorn/a
Meas. Tech.Human 5-HT1A Receptor Binding Assay
pH7.4±n/a
Ki 0.480±n/a nM
Commentsextracted
Citation Zhang, YJin, CZhou, R Substituted piperazine compounds and methods of use thereof US Patent US9714232 Publication Date 7/25/2017
 
5-hydroxytryptamine receptor 1A
Name:5-hydroxytryptamine receptor 1A
Type:n/a
Mol. Mass.:46122.49
Organism:Homo sapiens (Human)
Description:n/a
Residue:422
BDBM264104
NameBDBM264104
Synonyms:3-(4-(4-(4-(4-methyl-2-oxopyridin-1(2H)-yl)phenyl)piperazin-1-yl)butyl)-1H-indole-5-carbonitrile | US9714232, 17
TypeSmall organic molecule
Emp. Form.C29H31N5O
Mol. Mass.465.5893
SMILESCc1ccn(-c2ccc(cc2)N2CCN(CCCCc3c[nH]c4ccc(cc34)C#N)CC2)c(=O)c1