Reaction Details
Target5-hydroxytryptamine receptor 1A
LigandBDBM264112
Substrate/Competitorn/a
Meas. Tech.Human 5-HT1A Receptor Binding Assay
pH7.4±n/a
Ki 0.180±n/a nM
Commentsextracted
Citation Zhang, YJin, CZhou, R Substituted piperazine compounds and methods of use thereof US Patent US9714232 Publication Date 7/25/2017
 
5-hydroxytryptamine receptor 1A
Name:5-hydroxytryptamine receptor 1A
Type:n/a
Mol. Mass.:46122.49
Organism:Homo sapiens (Human)
Description:n/a
Residue:422
BDBM264112
NameBDBM264112
Synonyms:3-(4-(4-(4-(3,5-difluoro-2-oxopyridin-1(2H)-yl)phenyl)piperazin-1-yl)butyl)-1H-indole-5-carbonitrile | US9714232, 25
TypeSmall organic molecule
Emp. Form.C28H27F2N5O
Mol. Mass.487.5437
SMILESFc1cc(F)c(=O)n(c1)-c1ccc(cc1)N1CCN(CCCCc2c[nH]c3ccc(cc23)C#N)CC1