Reaction Details
TargetEphrin type-B receptor 1
LigandBDBM31096
Substrate/Competitorn/a
Meas. Tech.Kinase Inhibitor Selectivity Profiling Assay
Kd 240±n/a nM
Citation PubChem, PC Kinase Inhibitor Selectivity Profiling Assay PubChem Bioassay(2008)[AID]
 
Ephrin type-B receptor 1
Name:Ephrin type-B receptor 1
Type:Enzyme Catalytic Domain
Mol. Mass.:109882.53
Organism:Homo sapiens (Human)
Description:EPH receptor B1 EPHB1 HUMAN::P54762
Residue:984
BDBM31096
NameBDBM31096
Synonyms:CHEMBL290084 cid_451705
TypeSmall organic molecule
Emp. Form.C28H26N4O3
Mol. Mass.466.531
SMILESCN[C@H]1C[C@@H]2O[C@](C)([C@H]1OC)n1c3ccccc3c3c4CNC(=O)c4c4c5ccccc5n2c4c13