Reaction Details
TargetTyrosine-protein kinase JAK2
LigandBDBM6866
Substrate/Competitorn/a
Meas. Tech.Kinase Inhibitor Selectivity Profiling Assay
Ki 220000±n/a nM
Citation PubChem, PC Kinase Inhibitor Selectivity Profiling Assay PubChem Bioassay(2008)[AID]
 
Tyrosine-protein kinase JAK2
Name:Tyrosine-protein kinase JAK2
Type:Protein
Mol. Mass.:130684.68
Organism:Homo sapiens (Human)
Description:O60674
Residue:1132
BDBM6866
NameBDBM6866
Synonyms:1-Acyl-1H-[1,2,4]triazole-3,5-diamine Analogue 3b 4-[[5-Amino-1-(2,6-difluorobenzoyl)-1H-1,2,4-triazol-3-yl]amino]-benzenesulfonamide JNJ-7706621 | cid_5330790
TypeSmall organic molecule
Emp. Form.C15H12F2N6O3S
Mol. Mass.394.356
SMILESNc1nc(Nc2ccc(cc2)S(N)(=O)=O)nn1C(=O)c1c(F)cccc1F