Reaction Details
TargetMyosin light chain kinase 2, skeletal/cardiac muscle
LigandBDBM5931
Substrate/Competitorn/a
Meas. Tech.Kinase Inhibitor Selectivity Profiling Assay
Kd 980±n/a nM
Citation PubChem, PC Kinase Inhibitor Selectivity Profiling Assay PubChem Bioassay(2008)[AID]
 
Myosin light chain kinase 2, skeletal/cardiac muscle
Name:Myosin light chain kinase 2, skeletal/cardiac muscle
Type:PROTEIN
Mol. Mass.:64687.13
Organism:Homo sapiens (Human)
Description:ChEMBL_586581
Residue:596
BDBM5931
NameBDBM5931
Synonyms:BMS-387072 N-(5-{[(5-tert-butyl-1,3-oxazol-2-yl)methyl]sulfanyl}-1,3-thiazol-2-yl)piperidine-4-carboxamide cid_3025986
TypeSmall organic molecule
Emp. Form.C17H24N4O2S2
Mol. Mass.380.528
SMILESCC(C)(C)c1cnc(CSc2cnc(NC(=O)C3CCNCC3)s2)o1