Reaction Details
TargetCyclin-dependent kinase 18 [3-474]
LigandBDBM31096
Substrate/Competitorn/a
Meas. Tech.Kinase Inhibitor Selectivity Profiling Assay
Kd 270±n/a nM
Citation PubChem, PC Kinase Inhibitor Selectivity Profiling Assay PubChem Bioassay(2008)[AID]
 
Cyclin-dependent kinase 18 [3-474]
Name:Cyclin-dependent kinase 18 [3-474]
Type:PROTEIN
Mol. Mass.:54193.55
Organism:Homo sapiens (Human)
Description:ChEMBL_774354
Residue:472
BDBM31096
NameBDBM31096
Synonyms:CHEMBL290084 cid_451705
TypeSmall organic molecule
Emp. Form.C28H26N4O3
Mol. Mass.466.531
SMILESCN[C@H]1C[C@@H]2O[C@](C)([C@H]1OC)n1c3ccccc3c3c4CNC(=O)c4c4c5ccccc5n2c4c13