Reaction Details
TargetTGF-beta receptor type-2
LigandBDBM31099
Substrate/Competitorn/a
Meas. Tech.Kinase Inhibitor Selectivity Profiling Assay
Kd 5600±n/a nM
Citation PubChem, PC Kinase Inhibitor Selectivity Profiling Assay PubChem Bioassay(2008)[AID]
 
TGF-beta receptor type-2
Name:TGF-beta receptor type-2
Type:PROTEIN
Mol. Mass.:64559.49
Organism:Homo sapiens (Human)
Description:ChEMBL_586859
Residue:567
BDBM31099
NameBDBM31099
Synonyms:2-(2-chlorophenyl)-5,7-dihydroxy-8-[(3S)-3-hydroxy-1-methyl-4-piperidinyl]-1-benzopyran-4-one 2-(2-chlorophenyl)-5,7-dihydroxy-8-[(3S)-3-hydroxy-1-methylpiperidin-4-yl]chromen-4-one CHEMBL45741 cid_24867231
TypeSmall organic molecule
Emp. Form.C21H20ClNO5
Mol. Mass.401.84
SMILESCN1CCC([C@H](O)C1)c1c(O)cc(O)c2c1oc(cc2=O)-c1ccccc1Cl