Reaction Details
TargetTRAF2 and NCK-interacting protein kinase
LigandBDBM21
Substrate/Competitorn/a
Meas. Tech.Kinase Inhibitor Selectivity Profiling Assay
Kd 2300±n/a nM
Citation PubChem, PC Kinase Inhibitor Selectivity Profiling Assay PubChem Bioassay(2008)[AID]
 
TRAF2 and NCK-interacting protein kinase
Name:TRAF2 and NCK-interacting protein kinase
Type:Protein
Mol. Mass.:154954.98
Organism:Homo sapiens (Human)
Description:Q9UKE5
Residue:1360
BDBM21
NameBDBM21
Synonyms:CHEMBL24828 VANDETANIB ZD6474 | cid_3081361
Typen/a
Emp. Form.C22H24BrFN4O2
Mol. Mass.475.354
SMILESCOc1cc2c(Nc3ccc(Br)cc3F)ncnc2cc1OCC1CCN(C)CC1