Reaction Details
TargetSerine/threonine-protein kinase MRCK beta
LigandBDBM21
Substrate/Competitorn/a
Meas. Tech.Kinase Inhibitor Selectivity Profiling Assay
Kd 2500±n/a nM
Citation PubChem, PC Kinase Inhibitor Selectivity Profiling Assay PubChem Bioassay(2008)[AID]
 
Serine/threonine-protein kinase MRCK beta
Name:Serine/threonine-protein kinase MRCK beta
Type:Protien
Mol. Mass.:194307.09
Organism:Homo sapiens (Human)
Description:Q9Y5S2
Residue:1711
BDBM21
NameBDBM21
Synonyms:CHEMBL24828 VANDETANIB ZD6474 | cid_3081361
Typen/a
Emp. Form.C22H24BrFN4O2
Mol. Mass.475.354
SMILESCOc1cc2c(Nc3ccc(Br)cc3F)ncnc2cc1OCC1CCN(C)CC1