Reaction Details
TargetNeuronal acetylcholine receptor subunit alpha-7
LigandBDBM125047
Substrate/Competitorn/a
Meas. Tech.Alpha 7 UAChR Inhibition Assay
pH7.4±n/a
Ki 2.10±n/a nM
Commentsextracted
Citation Fleβner, TBöβ, FErb, CHafner, FSchnizler, KLang, DLuithle, JVan Kampen, MVan Der Staay, F Azabicyclic carbamates and their use as alpha-7 nicotinic acetylcholine receptor agonists US Patent US9714242 Publication Date 7/25/2017
 
Neuronal acetylcholine receptor subunit alpha-7
Name:Neuronal acetylcholine receptor subunit alpha-7
Type:Enzyme
Mol. Mass.:56502.44
Organism:Rattus norvegicus (Rat)
Description:Q05941
Residue:502
BDBM125047
NameBDBM125047
Synonyms:US8772511, 4 | US9714242, 22
TypeSmall organic molecule
Emp. Form.C24H26N4O3S
Mol. Mass.450.553
SMILESCOc1ccc(NC(=O)Nc2ccc3cc(sc3c2)C(=O)N[C@H]2CN3CCC2CC3)cc1