Reaction Details
TargetArachidonate 5-lipoxygenase-activating protein
LigandBDBM145657
Substrate/Competitorn/a
Meas. Tech.FLAP Binding Assay
Ki 0.74±n/a nM
Citation Chai, WDvorak, CAEccles, WEdwards, JPGoldberg, SDKrawczuk, PJLebsack, ADLiu, JPippel, DJSales, ZSTanis, VMTichenor, MSWiener, JJ 1,2,6-substituted benzimidazoles as flap modulators US Patent US9695149 Publication Date 7/4/2017
 
Arachidonate 5-lipoxygenase-activating protein
Name:Arachidonate 5-lipoxygenase-activating protein
Type:Enzyme
Mol. Mass.:18159.90
Organism:Homo sapiens (Human)
Description:P20292
Residue:161
BDBM145657
NameBDBM145657
Synonyms:US8952177, 11 US9695149, 11
TypeSmall organic molecule
Emp. Form.C28H27BrFN3O3
Mol. Mass.552.435
SMILESCc1ccc(COc2ccc3nc([C@@H]4CCCC[C@@H]4C(O)=O)n(Cc4ccc(Br)cc4F)c3c2)nc1