Reaction Details
TargetWee1-like protein kinase
LigandBDBM264269
Substrate/Competitorn/a
Meas. Tech.Wee-1 kinase Assay
Temperature298.15±n/a K
IC50<10±n/a nM
Commentsextracted
Citation O Dowd, CRRountree, JSBurkamp, FWilkinson, AJ Substituted pyrido[4,3-d]pyrimidines as Wee-1 inhibitors US Patent US9714244 Publication Date 7/25/2017
 
Wee1-like protein kinase
Name:Wee1-like protein kinase
Type:PROTEIN
Mol. Mass.:71599.12
Organism:Homo sapiens (Human)
Description:ChEMBL_1445054
Residue:646
BDBM264269
NameBDBM264269
Synonyms:6-(2,6-Dichlorophenyl)-2-((4-(piperazin-1-yl)phenyl)amino)-8-(pyridin-3-yl)pyrido[4,3-d]pyrimidin-5(6H)-one | US9714244, 23
TypeSmall organic molecule
Emp. Form.C28H23Cl2N7O
Mol. Mass.544.435
SMILESClc1cccc(Cl)c1-n1cc(-c2cccnc2)c2nc(Nc3ccc(cc3)N3CCNCC3)ncc2c1=O