Reaction Details
TargetWee1-like protein kinase
LigandBDBM31090
Substrate/Competitorn/a
Meas. Tech.Kinase Inhibitor Selectivity Profiling Assay
Kd 770±n/a nM
Citation PubChem, PC Kinase Inhibitor Selectivity Profiling Assay PubChem Bioassay(2008)[AID]
 
Wee1-like protein kinase
Name:Wee1-like protein kinase
Type:PROTEIN
Mol. Mass.:71599.12
Organism:Homo sapiens (Human)
Description:ChEMBL_1445054
Residue:646
BDBM31090
NameBDBM31090
Synonyms:(E)-N-[4-(3-chloro-4-fluoro-anilino)-3-cyano-7-ethoxy-6-quinolyl]-4-(dimethylamino)but-2-enamide (E)-N-[4-(3-chloro-4-fluoroanilino)-3-cyano-7-ethoxyquinolin-6-yl]-4-(dimethylamino)but-2-enamide EKB-569 cid_6445562
TypeSmall organic molecule
Emp. Form.C24H23ClFN5O2
Mol. Mass.467.923
SMILESCCOc1cc2ncc(C#N)c(Nc3ccc(F)c(Cl)c3)c2cc1NC(=O)\C=C\CN(C)C