Reaction Details
TargetRibosomal protein S6 kinase alpha-1
LigandBDBM13336
Substrate/Competitorn/a
Meas. Tech.Kinase Inhibitor Selectivity Profiling Assay
Ki 320000±n/a nM
Citation PubChem, PC Kinase Inhibitor Selectivity Profiling Assay PubChem Bioassay(2008)[AID]
 
Ribosomal protein S6 kinase alpha-1
Name:Ribosomal protein S6 kinase alpha-1
Type:Serine/threonine-protein kinase
Mol. Mass.:82736.10
Organism:Homo sapiens (Human)
Description:n/a
Residue:735
BDBM13336
NameBDBM13336
Synonyms:4-[4-(4-fluorophenyl)-2-(4-methanesulfinylphenyl)-1H-imidazol-5-yl]pyridine 4-{4-(4-fluorophenyl)-2-[4-(methylsulfinyl)phenyl]-1H-imidazol-5-yl}pyridine SB-203580 cid_176155
TypeSmall organic molecule
Emp. Form.C21H16FN3OS
Mol. Mass.377.435
SMILESCS(=O)c1ccc(cc1)-c1nc(c([nH]1)-c1ccc(F)cc1)-c1ccncc1