Reaction Details
TargetRibosomal protein S6 kinase alpha-4
LigandBDBM4814
Substrate/Competitorn/a
Meas. Tech.Kinase Inhibitor Selectivity Profiling Assay
Ki 2000000±n/a nM
Citation PubChem, PC Kinase Inhibitor Selectivity Profiling Assay PubChem Bioassay(2008)[AID]
 
Ribosomal protein S6 kinase alpha-4
Name:Ribosomal protein S6 kinase alpha-4
Type:Serine/threonine-protein kinase
Mol. Mass.:85620.38
Organism:Homo sapiens (Human)
Description:Recombinant MSK2 was phosphorylated by incubation with active p38alpha before assays.
Residue:772
BDBM4814
NameBDBM4814
Synonyms:CHEMBL535 N-[2-(diethylamino)ethyl]-5-{[(3Z)-5-fluoro-2-oxo-2,3-dihydro-1H-indol-3-ylidene]methyl}-2,4-dimethyl-1H-pyrrole-3-carboxamide SUNITINIB US10464902, Sunitinib US9914707, SU11248
TypeSmall organic molecule
Emp. Form.C22H27FN4O2
Mol. Mass.398.4738
SMILESCCN(CC)CCNC(=O)c1c(C)[nH]c(\C=C2/C(=O)Nc3ccc(F)cc23)c1C