Reaction Details
TargetSerine/threonine-protein kinase BRSK1
LigandBDBM31095
Substrate/Competitorn/a
Meas. Tech.Kinase Inhibitor Selectivity Profiling Assay
Kd 5000±n/a nM
Citation PubChem, PC Kinase Inhibitor Selectivity Profiling Assay PubChem Bioassay(2008)[AID]
 
Serine/threonine-protein kinase BRSK1
Name:Serine/threonine-protein kinase BRSK1
Type:Enzyme Catalytic Domain
Mol. Mass.:85119.02
Organism:Homo sapiens (Human)
Description:gi_24308326
Residue:778
BDBM31095
NameBDBM31095
Synonyms:5-[(Z)-(5-fluoranyl-2-oxidanylidene-1H-indol-3-ylidene)methyl]-2,4-dimethyl-N-[(2S)-3-morpholin-4-yl-2-oxidanyl-propyl]-1H-pyrrole-3-carboxamide 5-[(Z)-(5-fluoro-2-oxo-1H-indol-3-ylidene)methyl]-N-[(2S)-2-hydroxy-3-(4-morpholinyl)propyl]-2,4-dimethyl-1H-pyrrole-3-carboxamide SU-14813 | cid_10138259
TypeSmall organic molecule
Emp. Form.C23H27FN4O4
Mol. Mass.442.4833
SMILESCc1[nH]c(\C=C2/C(=O)Nc3ccc(F)cc23)c(C)c1C(=O)NC[C@H](O)CN1CCOCC1