Reaction Details
TargetSphingosine 1-phosphate receptor 1
LigandBDBM31040
Substrate/Competitorn/a
Meas. Tech.Dose Response Assays for S1P1 Agonists and Agonism Potentiators - Potentiator Assay 60K MLSMR
EC50 4287±n/a nM
Citation PubChem, PC Dose Response Assays for S1P1 Agonists and Agonism Potentiators - Potentiator Assay 60K MLSMR PubChem Bioassay(2007)[AID]
 
Sphingosine 1-phosphate receptor 1
Name:Sphingosine 1-phosphate receptor 1
Type:Enzyme
Mol. Mass.:42836.02
Organism:Homo sapiens (Human)
Description:P21453
Residue:382
BDBM31040
NameBDBM31040
Synonyms:1-Ethyl-6-methyl-3-phenyl-1H-pyrimido[5,4-e][1,2,4]triazine-5,7-dione 1-ethyl-6-methyl-3-phenyl-pyrimido[5,4-e][1,2,4]triazine-5,7-quinone MLS000027832 US9073941, 602 | cid_647501
TypeSmall organic molecule
Emp. Form.C14H13N5O2
Mol. Mass.283.2853
SMILESCCn1nc(nc2c1nc(=O)n(C)c2=O)-c1ccccc1