Reaction Details
TargetSphingosine 1-phosphate receptor 1
LigandBDBM36908
Substrate/Competitorn/a
Meas. Tech.Dose Response Assays for S1P1 Agonists and Agonism Potentiators - Potentiator Assay 60K MLSMR
EC50 7096±n/a nM
Citation PubChem, PC Dose Response Assays for S1P1 Agonists and Agonism Potentiators - Potentiator Assay 60K MLSMR PubChem Bioassay(2007)[AID]
 
Sphingosine 1-phosphate receptor 1
Name:Sphingosine 1-phosphate receptor 1
Type:Enzyme
Mol. Mass.:42836.02
Organism:Homo sapiens (Human)
Description:P21453
Residue:382
BDBM36908
NameBDBM36908
Synonyms:2-methoxy-4-(5-piperidin-1-ylpenta-1,3-diynyl)phenol;hydrochloride 2-methoxy-4-[5-(1-piperidinyl)penta-1,3-diynyl]phenol;hydrochloride SMR000057989 | cid_2852203
TypeSmall organic molecule
Emp. Form.C17H19NO2
Mol. Mass.269.3383
SMILESCOc1cc(ccc1O)C#CC#CCN1CCCCC1