Reaction Details
TargetPantothenate synthetase
LigandBDBM37291
Substrate/Competitorn/a
Meas. Tech.Mycobacterium tuberculosis Pantothenate Synthetase Assay
IC50>100000±n/a nM
CommentsExtracted from aid = 375 and tid = 12
Citation PubChem, PC Mycobacterium tuberculosis Pantothenate Synthetase Assay PubChem Bioassay(2006)[AID]
 
Pantothenate synthetase
Name:Pantothenate synthetase
Type:n/a
Mol. Mass.:32675.10
Organism:Mycobacterium tuberculosis (strain ATCC 25618 / H37Rv)
Description:ChEMBL_102878
Residue:309
BDBM37291
NameBDBM37291
Synonyms:MLS000087136 N-[1-(4-chlorobenzyl)-5-methyl-pyrazol-3-yl]-5-(3,4-dimethoxyphenyl)isoxazole-3-carboxamide N-[1-[(4-chlorophenyl)methyl]-5-methyl-pyrazol-3-yl]-5-(3,4-dimethoxyphenyl)-1,2-oxazole-3-carboxamide SMR000023359 | cid_3237184
TypeSmall organic molecule
Emp. Form.C23H21ClN4O4
Mol. Mass.452.89
SMILESCOc1ccc(cc1OC)-c1cc(no1)C(=O)Nc1cc(C)n(Cc2ccc(Cl)cc2)n1