Reaction Details
TargetPantothenate synthetase
LigandBDBM37296
Substrate/Competitorn/a
Meas. Tech.Mycobacterium tuberculosis Pantothenate Synthetase Assay
IC50>100000±n/a nM
CommentsExtracted from aid = 375 and tid = 17
Citation PubChem, PC Mycobacterium tuberculosis Pantothenate Synthetase Assay PubChem Bioassay(2006)[AID]
 
Pantothenate synthetase
Name:Pantothenate synthetase
Type:n/a
Mol. Mass.:32675.10
Organism:Mycobacterium tuberculosis (strain ATCC 25618 / H37Rv)
Description:ChEMBL_102878
Residue:309
BDBM37296
NameBDBM37296
Synonyms:MLS000087377 N-[1-(4-methylbenzyl)pyrazol-3-yl]-4,5,6,7-tetrahydroindoxazene-3-carboxamide N-[1-[(4-methylphenyl)methyl]pyrazol-3-yl]-4,5,6,7-tetrahydro-1,2-benzoxazole-3-carboxamide cid_3240588
TypeSmall organic molecule
Emp. Form.C19H20N4O2
Mol. Mass.336.3877
SMILESCc1ccc(Cn2ccc(NC(=O)c3noc4CCCCc34)n2)cc1