Reaction Details
TargetPantothenate synthetase
LigandBDBM37297
Substrate/Competitorn/a
Meas. Tech.Mycobacterium tuberculosis Pantothenate Synthetase Assay
IC50>100000±n/a nM
CommentsExtracted from aid = 375 and tid = 17
Citation PubChem, PC Mycobacterium tuberculosis Pantothenate Synthetase Assay PubChem Bioassay(2006)[AID]
 
Pantothenate synthetase
Name:Pantothenate synthetase
Type:n/a
Mol. Mass.:32675.10
Organism:Mycobacterium tuberculosis (strain ATCC 25618 / H37Rv)
Description:ChEMBL_102878
Residue:309
BDBM37297
NameBDBM37297
Synonyms:7-methoxy-N-[1-(4-methylbenzyl)-1H-pyrazol-3-yl]-4,5-dihydronaphtho[2,1-d]isoxazole-3-carboxamide 7-methoxy-N-[1-[(4-methylphenyl)methyl]-3-pyrazolyl]-4,5-dihydrobenzo[g][1,2]benzoxazole-3-carboxamide MLS000087457 cid_3240939
TypeSmall organic molecule
Emp. Form.C24H22N4O3
Mol. Mass.414.4565
SMILESCOc1ccc2-c3onc(C(=O)Nc4ccn(Cc5ccc(C)cc5)n4)c3CCc2c1