Reaction Details
TargetDual specificity protein phosphatase 1
LigandBDBM35364
Substrate/Competitorn/a
Meas. Tech.In vitro MKP-1 Phosphatase Dose Response Confirmation and Secondary Selectivity/Specificity Assay
IC50 18140±n/a nM
Citation PubChem, PC In vitro MKP-1 Phosphatase Dose Response Confirmation and Secondary Selectivity/Specificity Assay PubChem Bioassay(2006)[AID]
 
Dual specificity protein phosphatase 1
Name:Dual specificity protein phosphatase 1
Type:Protein phosphatase
Mol. Mass.:39301.48
Organism:Homo sapiens (Human)
Description:gi_4758204
Residue:367
BDBM35364
NameBDBM35364
Synonyms:MLS000079944 cid_659878
TypeSmall organic molecule
Emp. Form.C26H21N5O3
Mol. Mass.451.4766
SMILESCOc1ccc(Cn2c(C)nc3n(Cc4ccco4)c4nc5ccccc5nc4c3c2=O)cc1