Reaction Details
TargetDual specificity protein phosphatase 6
LigandBDBM31040
Substrate/Competitorn/a
Meas. Tech.In vitro MKP-3 Phosphatase Dose Response Confirmation and Secondary Selectivity/Selectivity Assay
IC50 158.5±n/a nM
Citation PubChem, PC In vitro MKP-3 Phosphatase Dose Response Confirmation and Secondary Selectivity/Selectivity Assay PubChem Bioassay(2006)[AID]
 
Dual specificity protein phosphatase 6
Name:Dual specificity protein phosphatase 6
Type:Enzyme
Mol. Mass.:42303.19
Organism:Rattus norvegicus
Description:gi_16758752
Residue:381
BDBM31040
NameBDBM31040
Synonyms:1-Ethyl-6-methyl-3-phenyl-1H-pyrimido[5,4-e][1,2,4]triazine-5,7-dione 1-ethyl-6-methyl-3-phenyl-pyrimido[5,4-e][1,2,4]triazine-5,7-quinone MLS000027832 US9073941, 602 | cid_647501
TypeSmall organic molecule
Emp. Form.C14H13N5O2
Mol. Mass.283.2853
SMILESCCn1nc(nc2c1nc(=O)n(C)c2=O)-c1ccccc1