Reaction Details
TargetDual specificity protein phosphatase 6
LigandBDBM34230
Substrate/Competitorn/a
Meas. Tech.In vitro MKP-3 Phosphatase Dose Response Confirmation and Secondary Selectivity/Selectivity Assay
IC50>50000±n/a nM
Citation PubChem, PC In vitro MKP-3 Phosphatase Dose Response Confirmation and Secondary Selectivity/Selectivity Assay PubChem Bioassay(2006)[AID]
 
Dual specificity protein phosphatase 6
Name:Dual specificity protein phosphatase 6
Type:Enzyme
Mol. Mass.:42303.19
Organism:Rattus norvegicus
Description:gi_16758752
Residue:381
BDBM34230
NameBDBM34230
Synonyms:(Z)-7-[(1R,2S)-2-[(E,3S)-3-hydroxyoct-1-enyl]-5-keto-cyclopent-3-en-1-yl]hept-5-enoic acid (Z)-7-[(1R,2S)-2-[(E,3S)-3-hydroxyoct-1-enyl]-5-oxocyclopent-3-en-1-yl]hept-5-enoic acid MLS000069589 SMR000058790 | cid_5280880
TypeSmall organic molecule
Emp. Form.C20H30O4
Mol. Mass.334.4498
SMILESCCCCC[C@H](O)C=C[C@H]1C=CC(=O)[C@@H]1C\C=C/CCCC(O)=O