Reaction Details
TargetDual specificity protein phosphatase 6
LigandBDBM35364
Substrate/Competitorn/a
Meas. Tech.In vitro MKP-3 Phosphatase Dose Response Confirmation and Secondary Selectivity/Selectivity Assay
IC50 41190±n/a nM
Citation PubChem, PC In vitro MKP-3 Phosphatase Dose Response Confirmation and Secondary Selectivity/Selectivity Assay PubChem Bioassay(2006)[AID]
 
Dual specificity protein phosphatase 6
Name:Dual specificity protein phosphatase 6
Type:Enzyme
Mol. Mass.:42303.19
Organism:Rattus norvegicus
Description:gi_16758752
Residue:381
BDBM35364
NameBDBM35364
Synonyms:MLS000079944 cid_659878
TypeSmall organic molecule
Emp. Form.C26H21N5O3
Mol. Mass.451.4766
SMILESCOc1ccc(Cn2c(C)nc3n(Cc4ccco4)c4nc5ccccc5nc4c3c2=O)cc1