Reaction Details
TargetSphingosine 1-phosphate receptor 3
LigandBDBM26265
Substrate/Competitorn/a
Meas. Tech.Dose Response Assay for S1P3 Antagonists
IC50>49800±n/a nM
Citation PubChem, PC Dose Response Assay for S1P3 Antagonists PubChem Bioassay(2007)[AID]
 
Sphingosine 1-phosphate receptor 3
Name:Sphingosine 1-phosphate receptor 3
Type:G Protein-Coupled Receptor (GPCR)
Mol. Mass.:42278.13
Organism:Homo sapiens (Human)
Description:Q99500
Residue:378
BDBM26265
NameBDBM26265
Synonyms:(5S)-6-(5-chloropyridin-2-yl)-7-oxo-5H,6H,7H-pyrrolo[3,4-b]pyrazin-5-yl 4-methylpiperazine-1-carboxylate Estorra Lunesta | cid_5735
TypeSmall organic molecule
Emp. Form.C17H17ClN6O3
Mol. Mass.388.808
SMILESCN1CCN(CC1)C(=O)Oc1n(-c2ccc(Cl)cn2)c(=O)c2ncc[nH]c12