Reaction Details
TargetHuntingtin
LigandBDBM37536
Substrate/Competitorn/a
Meas. Tech.Clearance of Mutant Huntingtin Protein - Confirmatory screen
IC50<100±n/a nM
Citation PubChem, PC Clearance of Mutant Huntingtin Protein - Confirmatory screen PubChem Bioassay(2007)[AID]
 
Huntingtin
Name:Huntingtin
Type:PROTEIN
Mol. Mass.:347579.69
Organism:Homo sapiens (Human)
Description:EBI_101216
Residue:3142
BDBM37536
NameBDBM37536
Synonyms:(2E,4S,4aR,5S,5aR,6S,12aS)-2-[amino(hydroxy)methylene]-4-(dimethylamino)-5,6,10,11,12a-pentahydroxy-6-methyl-4,4a,5,5a-tetrahydrotetracene-1,3,12-trione (2E,4S,4aR,5S,5aR,6S,12aS)-2-[azanyl(oxidanyl)methylidene]-4-(dimethylamino)-6-methyl-5,6,10,11,12a-pentakis(oxidanyl)-4,4a,5,5a-tetrahydrotetracene-1,3,12-trione Oxytetracycline cid_5282186
TypeSmall organic molecule
Emp. Form.C22H24N2O9
Mol. Mass.460.434
SMILESCN(C)[C@H]1[C@@H]2[C@@H](O)[C@H]3C(C(=O)c4c(O)cccc4[C@@]3(C)O)C(=O)[C@]2(O)C(=O)C(C(N)=O)C1=O