Reaction Details
TargetfMet-Leu-Phe receptor
LigandBDBM37760
Substrate/Competitorn/a
Meas. Tech.Dose Response Assay for Formylpeptide Receptor (FPR) Ligands and Dose Response Counter-Screen Assay for Formylpeptide-Like-1 (FPRL1) Ligands
Ki 9000±n/a nM
Citation PubChem, PC Dose Response Assay for Formylpeptide Receptor (FPR) Ligands and Dose Response Counter-Screen Assay for Formylpeptide-Like-1 (FPRL1) Ligands PubChem Bioassay(2007)[AID]
 
fMet-Leu-Phe receptor
Name:fMet-Leu-Phe receptor
Type:Enzyme Catalytic Domain
Mol. Mass.:38456.14
Organism:Homo sapiens (Human)
Description:gi_4503779
Residue:350
BDBM37760
NameBDBM37760
Synonyms:1-(3-imidazol-1-ylpropyl)-3-(5-methylfuran-2-yl)carbonyl-4-oxidanyl-2-(4-propoxyphenyl)-2H-pyrrol-5-one 3-hydroxy-1-[3-(1H-imidazol-1-yl)propyl]-4-(5-methyl-2-furoyl)-5-(4-propoxyphenyl)-1,5-dihydro-2H-pyrrol-2-one 4-hydroxy-1-[3-(1-imidazolyl)propyl]-3-[(5-methyl-2-furanyl)-oxomethyl]-2-(4-propoxyphenyl)-2H-pyrrol-5-one SMR000075421 | cid_2950328
TypeSmall organic molecule
Emp. Form.C25H27N3O5
Mol. Mass.449.499
SMILESCCCOc1ccc(cc1)C1C(C(=O)c2ccc(C)o2)C(=O)C(=O)N1CCCn1ccnc1