Reaction Details
TargetfMet-Leu-Phe receptor
LigandBDBM37806
Substrate/Competitorn/a
Meas. Tech.Dose Response Assay for Formylpeptide Receptor (FPR) Ligands and Dose Response Counter-Screen Assay for Formylpeptide-Like-1 (FPRL1) Ligands
Ki 7600±n/a nM
Citation PubChem, PC Dose Response Assay for Formylpeptide Receptor (FPR) Ligands and Dose Response Counter-Screen Assay for Formylpeptide-Like-1 (FPRL1) Ligands PubChem Bioassay(2007)[AID]
 
fMet-Leu-Phe receptor
Name:fMet-Leu-Phe receptor
Type:Enzyme Catalytic Domain
Mol. Mass.:38456.14
Organism:Homo sapiens (Human)
Description:gi_4503779
Residue:350
BDBM37806
NameBDBM37806
Synonyms:(4Z)-4-[(4-chlorophenyl)-hydroxy-methylene]-5-(5-methyl-2-furyl)-1-(tetrahydrofurfuryl)pyrrolidine-2,3-quinone (4Z)-4-[(4-chlorophenyl)-hydroxymethylidene]-5-(5-methylfuran-2-yl)-1-(oxolan-2-ylmethyl)pyrrolidine-2,3-dione MLS000114012 cid_5310704
TypeSmall organic molecule
Emp. Form.C21H20ClNO5
Mol. Mass.401.84
SMILESCc1ccc(o1)C1C(C(=O)c2ccc(Cl)cc2)C(=O)C(=O)N1CC1CCCO1