Reaction Details
TargetCytochrome P450 11B1, mitochondrial
LigandBDBM101354
Substrate/Competitorn/a
Meas. Tech.Cellular Enzyme Assay
Temperature310.15±n/a K
EC50 0.40±n/a nM
Commentsextracted
Citation Aebi, JAmrein, KChen, WHornsperger, BKuhn, BLiu, YMaerki, HPMartin, REMayweg, ATan, XWang, LZhou, M 3,4-dihydro-2H-isoquinoline-1-one and 2,3-dihydro-isoindol-1-one compounds US Patent US9695151 Publication Date 7/4/2017
 
Cytochrome P450 11B1, mitochondrial
Name:Cytochrome P450 11B1, mitochondrial
Type:Enzyme
Mol. Mass.:57591.44
Organism:Homo sapiens (Human)
Description:P15538
Residue:503
BDBM101354
NameBDBM101354
Synonyms:US9695151, 20
TypeSmall organic molecule
Emp. Form.C23H29ClN4O3S
Mol. Mass.477.019
SMILESCCS(=O)(=O)N1CCC(CC1)N(C)c1cncc(c1)N1C(=O)c2ccc(Cl)cc2C1(C)C