Reaction Details
TargetN-formyl peptide receptor 2
LigandBDBM37688
Substrate/Competitorn/a
Meas. Tech.Dose Response Assay for Formylpeptide Receptor-Like-1 (FPRL1) Ligands and Dose Response Counter-Screen Assay for Formylpeptide Receptor (FPR) Ligands
Ki>40300±n/a nM
CommentsExtracted from aid = 520 and tid = 2
Citation PubChem, PC Dose Response Assay for Formylpeptide Receptor-Like-1 (FPRL1) Ligands and Dose Response Counter-Screen Assay for Formylpeptide Receptor (FPR) Ligands PubChem Bioassay(2007)[AID]
 
N-formyl peptide receptor 2
Name:N-formyl peptide receptor 2
Type:G Protein-Coupled Receptor (GPCR)
Mol. Mass.:38968.35
Organism:Homo sapiens (Human)
Description:P25090
Residue:351
BDBM37688
NameBDBM37688
Synonyms:1-(4-amino-1,2,5-oxadiazol-3-yl)-5-(3,4-dihydro-1H-isoquinolin-2-ylmethyl)-4-triazolecarboxylic acid propan-2-yl ester MLS000089738 cid_1043390 propan-2-yl 1-(4-amino-1,2,5-oxadiazol-3-yl)-5-(3,4-dihydro-1H-isoquinolin-2-ylmethyl)triazole-4-carboxylate | propan-2-yl 1-(4-azanyl-1,2,5-oxadiazol-3-yl)-5-(3,4-dihydro-1H-isoquinolin-2-ylmethyl)-1,2,3-triazole-4-carboxylate
TypeSmall organic molecule
Emp. Form.C18H21N7O3
Mol. Mass.383.4044
SMILESCC(C)OC(=O)c1nnn(c1CN1CCc2ccccc2C1)-c1nonc1N