Reaction Details
TargetN-formyl peptide receptor 2
LigandBDBM37692
Substrate/Competitorn/a
Meas. Tech.Dose Response Assay for Formylpeptide Receptor-Like-1 (FPRL1) Ligands and Dose Response Counter-Screen Assay for Formylpeptide Receptor (FPR) Ligands
Ki 9100±n/a nM
CommentsExtracted from aid = 520 and tid = 2
Citation PubChem, PC Dose Response Assay for Formylpeptide Receptor-Like-1 (FPRL1) Ligands and Dose Response Counter-Screen Assay for Formylpeptide Receptor (FPR) Ligands PubChem Bioassay(2007)[AID]
 
N-formyl peptide receptor 2
Name:N-formyl peptide receptor 2
Type:G Protein-Coupled Receptor (GPCR)
Mol. Mass.:38968.35
Organism:Homo sapiens (Human)
Description:P25090
Residue:351
BDBM37692
NameBDBM37692
Synonyms:(2-aminophenyl)-(4-aminophenyl)amine MLS000084680 SMR000015718 | cid_774866
TypeSmall organic molecule
Emp. Form.C12H13N3
Mol. Mass.199.2517
SMILESNc1ccc(Nc2ccccc2N)cc1