Reaction Details
TargetN-formyl peptide receptor 2
LigandBDBM37827
Substrate/Competitorn/a
Meas. Tech.Dose Response Assay for Formylpeptide Receptor-Like-1 (FPRL1) Ligands and Dose Response Counter-Screen Assay for Formylpeptide Receptor (FPR) Ligands
Ki 19100±n/a nM
CommentsExtracted from aid = 520 and tid = 2
Citation PubChem, PC Dose Response Assay for Formylpeptide Receptor-Like-1 (FPRL1) Ligands and Dose Response Counter-Screen Assay for Formylpeptide Receptor (FPR) Ligands PubChem Bioassay(2007)[AID]
 
N-formyl peptide receptor 2
Name:N-formyl peptide receptor 2
Type:G Protein-Coupled Receptor (GPCR)
Mol. Mass.:38968.35
Organism:Homo sapiens (Human)
Description:P25090
Residue:351
BDBM37827
NameBDBM37827
Synonyms:2-methyl-5-(4-nitrophenyl)-3-phenyl-1H-pyrazolo[1,5-a]pyrimidin-7-one MLS000547439 cid_1051569
TypeSmall organic molecule
Emp. Form.C19H14N4O3
Mol. Mass.346.3395
SMILESCc1[nH]n2c(nc(cc2=O)-c2ccc(cc2)[N+]([O-])=O)c1-c1ccccc1