Reaction Details
TargetN-formyl peptide receptor 2
LigandBDBM32017
Substrate/Competitorn/a
Meas. Tech.Dose Response Assay for Formylpeptide Receptor-Like-1 (FPRL1) Ligands and Dose Response Counter-Screen Assay for Formylpeptide Receptor (FPR) Ligands
IC50 25100±n/a nM
CommentsExtracted from aid = 520 and tid = 3
Citation PubChem, PC Dose Response Assay for Formylpeptide Receptor-Like-1 (FPRL1) Ligands and Dose Response Counter-Screen Assay for Formylpeptide Receptor (FPR) Ligands PubChem Bioassay(2007)[AID]
 
N-formyl peptide receptor 2
Name:N-formyl peptide receptor 2
Type:G Protein-Coupled Receptor (GPCR)
Mol. Mass.:38968.35
Organism:Homo sapiens (Human)
Description:P25090
Residue:351
BDBM32017
NameBDBM32017
Synonyms:(7S,9S)-7-[(2R,4S,5S,6S)-4-azanyl-6-methyl-5-oxidanyl-oxan-2-yl]oxy-9-ethanoyl-4-methoxy-6,9,11-tris(oxidanyl)-8,10-dihydro-7H-tetracene-5,12-dione;hydrochloride (7S,9S)-9-acetyl-7-[(2R,4S,5S,6S)-4-amino-5-hydroxy-6-methyloxan-2-yl]oxy-6,9,11-trihydroxy-4-methoxy-8,10-dihydro-7H-tetracene-5,12-dione;hydrochloride DAUNORUBICIN HYDROCHLORIDE MLS000069508 cid_62770
TypeSmall organic molecule
Emp. Form.C27H29NO10
Mol. Mass.527.5199
SMILESCOc1cccc2C(=O)c3c(O)c4C[C@](O)(C[C@H](O[C@H]5C[C@H](N)[C@H](O)[C@H](C)O5)c4c(O)c3C(=O)c12)C(C)=O