Reaction Details
TargetN-formyl peptide receptor 2
LigandBDBM37754
Substrate/Competitorn/a
Meas. Tech.Dose Response Assay for Formylpeptide Receptor-Like-1 (FPRL1) Ligands and Dose Response Counter-Screen Assay for Formylpeptide Receptor (FPR) Ligands
IC50 22800±n/a nM
CommentsExtracted from aid = 520 and tid = 3
Citation PubChem, PC Dose Response Assay for Formylpeptide Receptor-Like-1 (FPRL1) Ligands and Dose Response Counter-Screen Assay for Formylpeptide Receptor (FPR) Ligands PubChem Bioassay(2007)[AID]
 
N-formyl peptide receptor 2
Name:N-formyl peptide receptor 2
Type:G Protein-Coupled Receptor (GPCR)
Mol. Mass.:38968.35
Organism:Homo sapiens (Human)
Description:P25090
Residue:351
BDBM37754
NameBDBM37754
Synonyms:MLS000045942 N-(5-imidazo[1,2-a]pyrimidin-2-yl-2-methoxy-phenyl)butyramide N-[5-(2-imidazo[1,2-a]pyrimidinyl)-2-methoxyphenyl]butanamide cid_3245971
TypeSmall organic molecule
Emp. Form.C17H18N4O2
Mol. Mass.310.3504
SMILESCCCC(=O)Nc1cc(ccc1OC)-c1cn2cccnc2n1