Reaction Details
TargetDual specificity protein phosphatase 6
LigandBDBM35431
Substrate/Competitorn/a
Meas. Tech.In vitro MKP-3 Phosphatase Dose Response Hit/Probe Assessment Assay
IC50 2122±n/a nM
Citation PubChem, PC In vitro MKP-3 Phosphatase Dose Response Hit/Probe Assessment Assay PubChem Bioassay(2007)[AID]
 
Dual specificity protein phosphatase 6
Name:Dual specificity protein phosphatase 6
Type:Enzyme
Mol. Mass.:42303.19
Organism:Rattus norvegicus
Description:gi_16758752
Residue:381
BDBM35431
NameBDBM35431
Synonyms:MLS000106874 cid_774975
TypeSmall organic molecule
Emp. Form.C15H9NO3
Mol. Mass.251.2369
SMILESCOc1ccc2noc3-c4ccccc4C(=O)c1c23