Reaction Details
TargetMevalonate kinase
LigandBDBM34352
Substrate/Competitorn/a
Meas. Tech.Screening for Inhibitors of the Mevalonate Pathway in Streptococcus Pneumoniae - MK Dose Response
IC50 11710.4±n/a nM
Citation PubChem, PC Screening for Inhibitors of the Mevalonate Pathway in Streptococcus Pneumoniae - MK Dose Response PubChem Bioassay(2007)[AID]
 
Mevalonate kinase
Name:Mevalonate kinase
Synonyms:n/a
Type:Enzyme Catalytic Domain
Mol. Mass.:31420.64
Organism:Streptococcus pneumoniae D39
Description:A0A0H2ZQX9
Residue:292
BDBM34352
NameBDBM34352
TypeSmall organic molecule
Emp. Form.C11H13N3OS
Mol. Mass.235.305
SMILESC1CN(CCO1)Sc1nc2ccccc2[nH]1