Reaction Details
TargetMevalonate kinase
LigandBDBM34548
Substrate/Competitorn/a
Meas. Tech.Screening for Inhibitors of the Mevalonate Pathway in Streptococcus Pneumoniae - MK Dose Response
IC50 22299.5±n/a nM
Citation PubChem, PC Screening for Inhibitors of the Mevalonate Pathway in Streptococcus Pneumoniae - MK Dose Response PubChem Bioassay(2007)[AID]
 
Mevalonate kinase
Name:Mevalonate kinase
Synonyms:n/a
Type:Enzyme Catalytic Domain
Mol. Mass.:31420.64
Organism:Streptococcus pneumoniae D39
Description:A0A0H2ZQX9
Residue:292
BDBM34548
NameBDBM34548
TypeSmall organic molecule
Emp. Form.C15H13N3S
Mol. Mass.267.349
SMILESS=c1[nH]c2CCCCc2c(-c2cccnc2)c1C#N