Reaction Details
TargetMevalonate kinase
LigandBDBM34595
Substrate/Competitorn/a
Meas. Tech.Screening for Inhibitors of the Mevalonate Pathway in Streptococcus Pneumoniae - MK Dose Response
IC50 15364.4±n/a nM
Citation PubChem, PC Screening for Inhibitors of the Mevalonate Pathway in Streptococcus Pneumoniae - MK Dose Response PubChem Bioassay(2007)[AID]
 
Mevalonate kinase
Name:Mevalonate kinase
Synonyms:n/a
Type:Enzyme Catalytic Domain
Mol. Mass.:31420.64
Organism:Streptococcus pneumoniae D39
Description:A0A0H2ZQX9
Residue:292
BDBM34595
NameBDBM34595
TypeSmall organic molecule
Emp. Form.C18H19ClN4O3
Mol. Mass.374.821
SMILESCCOC(=O)C1C(NC(=O)N=C1C)c1c(C)nn(c1Cl)-c1ccccc1