Reaction Details
TargetDual specificity protein phosphatase 1
LigandBDBM31700
Substrate/Competitorn/a
Meas. Tech.In vitro MKP-1 Phosphatase Dose Response Active/Probe Assessment Assay - Effects of Catalase
IC50 17203±n/a nM
Citation PubChem, PC In vitro MKP-1 Phosphatase Dose Response Active/Probe Assessment Assay - Effects of Catalase PubChem Bioassay(2006)[AID]
 
Dual specificity protein phosphatase 1
Name:Dual specificity protein phosphatase 1
Type:Protein phosphatase
Mol. Mass.:39301.48
Organism:Homo sapiens (Human)
Description:gi_4758204
Residue:367
BDBM31700
NameBDBM31700
Synonyms:(5Z)-5-(5-bromo-2-methoxybenzylidene)-2-(2-furyl)[1,3]thiazolo[3,2-b][1,2,4]triazol-6(5H)-one 5-[(5-bromanyl-2-methoxy-phenyl)methylidene]-2-(furan-2-yl)-[1,3]thiazolo[3,2-b][1,2,4]triazol-6-one 5-[(5-bromo-2-methoxyphenyl)methylidene]-2-(furan-2-yl)-[1,3]thiazolo[3,2-b][1,2,4]triazol-6-one SMR000020576 | cid_3236807
TypeSmall organic molecule
Emp. Form.C16H10BrN3O3S
Mol. Mass.404.238
SMILESCOc1ccc(Br)cc1C=c1sc2nc(nn2c1=O)-c1ccco1