Reaction Details
TargetIsoform 2 of Nuclear receptor ROR-alpha (Alpha-2)
LigandBDBM38913
Substrate/Competitorn/a
Meas. Tech.Counterscreen for inhibitors of the nuclear receptor Steroidogenic Factor 1 (SF-1): A cell-based dose-response assay for inhibition of the RAR-related orphan receptor A (RORA)
IC50 906±n/a nM
Citation PubChem, PC Counterscreen for inhibitors of the nuclear receptor Steroidogenic Factor 1 (SF-1): A cell-based dose-response assay for inhibition of the RAR-related orphan receptor A (RORA) PubChem Bioassay(2007)[AID]
 
Isoform 2 of Nuclear receptor ROR-alpha (Alpha-2)
Name:Isoform 2 of Nuclear receptor ROR-alpha (Alpha-2)
Type:PROTEIN
Mol. Mass.:63033.59
Organism:Homo sapiens (Human)
Description:EBI_101591
Residue:556
BDBM38913
NameBDBM38913
Synonyms:3-[3-(4-tert-butylphenyl)-1,2,4-oxadiazol-5-yl]-N,N-dimethyl-propanamide 3-[3-(4-tert-butylphenyl)-1,2,4-oxadiazol-5-yl]-N,N-dimethylpropanamide SMR000046865 | cid_665578
TypeSmall organic molecule
Emp. Form.C17H23N3O2
Mol. Mass.301.3834
SMILESCN(C)C(=O)CCc1nc(no1)-c1ccc(cc1)C(C)(C)C